{"text_format":"1","workbook":"xlsx","n_sheets":9,"sheets":["はじめに","プルダウンリスト","別紙２①","参４_申請","参４_申請_事業計画","別紙６","別紙７","別紙７（別添）","別紙９"],"not_rendered":{"charts":0,"images":2,"macros":1,"external_links":6,"defined_names":117,"comments":1,"pivot_tables":0},"unopened":[],"bounds":{"document_bytes":16777216,"sheet_cells":100000,"rows_first":2000,"rows_last":500,"rows_between":2000,"halvings":0,"cell_chars":16384,"cell_head_chars":4096},"cells_cut":0,"cells_raw":0,"read":"whole","date_system":"1900"}

{"sheet":"はじめに","index":0,"n_rows":63,"n_cols":7,"rows_kept":63,"cut":false,"hidden":false,"merged":[[8,10,8,12],[19,62,19,64],[21,1,21,2],[19,119,19,121],[19,122,19,124],[19,125,19,127],[19,128,19,130],[19,146,19,148],[19,212,19,214],[19,179,19,181],[19,182,19,184],[19,188,19,190],[16,158,16,160],[16,161,16,163],[16,164,16,166],[16,200,16,202],[16,203,16,205],[16,206,16,208],[16,209,16,211],[16,212,16,214],[16,134,16,136],[16,65,16,67],[16,68,16,70],[16,71,16,73],[19,215,19,217],[19,149,19,151],[19,152,19,154],[19,140,19,142],[19,143,19,145],[19,65,19,67],[19,68,19,70],[19,71,19,73],[19,245,19,247],[19,74,19,76],[19,77,19,79],[19,80,19,82],[19,83,19,85],[19,86,19,88],[19,89,19,91],[19,92,19,94],[19,95,19,97],[19,131,19,133],[19,134,19,136],[19,137,19,139],[19,185,19,187],[19,206,19,208],[19,209,19,211],[19,176,19,178],[19,251,19,253],[19,254,19,256],[19,257,19,257],[19,227,19,229],[19,230,19,232],[19,233,19,235],[19,236,19,238],[19,239,19,241],[19,158,19,160],[19,161,19,163],[19,164,19,166],[19,167,19,169],[19,170,19,172],[19,242,19,244],[19,218,19,220],[19,221,19,223],[19,224,19,226],[19,191,19,193],[19,194,19,196],[19,197,19,199],[19,200,19,202],[19,203,19,205],[19,248,19,250],[19,173,19,175],[16,137,16,139],[16,140,16,142],[16,143,16,145],[16,146,16,148],[16,149,16,151],[16,152,16,154],[16,155,16,157],[19,98,19,100],[19,101,19,103],[19,104,19,106],[19,107,19,109],[19,110,19,112],[19,113,19,115],[19,116,19,118],[19,155,19,157],[16,110,16,112],[16,113,16,115],[16,116,16,118],[16,119,16,121],[16,122,16,124],[16,125,16,127],[16,128,16,130],[16,131,16,133],[16,101,16,103],[16,254,16,256],[16,167,16,169],[16,170,16,172],[16,173,16,175],[16,176,16,178],[16,179,16,181],[16,182,16,184],[16,185,16,187],[16,188,16,190],[16,191,16,193],[16,248,16,250],[16,251,16,253],[16,218,16,220],[16,221,16,223],[16,224,16,226],[16,227,16,229],[16,230,16,232],[16,233,16,235],[16,242,16,244],[16,245,16,247],[16,215,16,217],[16,257,16,257],[16,236,16,238],[16,239,16,241],[16,9,16,10],[16,11,16,13],[16,14,16,16],[16,17,16,19],[16,20,16,22],[16,23,16,25],[16,26,16,28],[16,29,16,31],[16,32,16,34],[16,35,16,37],[16,38,16,40],[16,41,16,43],[16,44,16,46],[16,47,16,49],[16,50,16,52],[16,53,16,55],[16,56,16,58],[16,59,16,61],[16,62,16,64],[16,194,16,196],[16,197,16,199],[16,104,16,106],[16,107,16,109],[14,185,14,187],[14,188,14,190],[14,191,14,193],[14,104,14,106],[14,107,14,109],[14,110,14,112],[14,113,14,115],[14,116,14,118],[14,119,14,121],[14,122,14,124],[14,125,14,127],[14,128,14,130],[14,131,14,133],[14,134,14,136],[14,137,14,139],[14,140,14,142],[14,143,14,145],[14,146,14,148],[14,179,14,181],[14,182,14,184],[14,155,14,157],[14,149,14,151],[14,221,14,223],[14,224,14,226],[14,227,14,229],[14,230,14,232],[14,194,14,196],[14,197,14,199],[14,200,14,202],[14,203,14,205],[14,206,14,208],[14,209,14,211],[14,212,14,214],[14,215,14,217],[14,218,14,220],[14,233,14,235],[14,236,14,238],[14,257,14,257],[14,239,14,241],[14,242,14,244],[14,245,14,247],[14,248,14,250],[14,251,14,253],[14,254,14,256],[14,152,14,154],[14,35,14,37],[14,38,14,40],[14,98,14,100],[14,101,14,103],[14,68,14,70],[14,71,14,73],[14,29,14,31],[14,176,14,178],[14,167,14,169],[14,170,14,172],[14,173,14,175],[14,77,14,79],[14,80,14,82],[14,89,14,91],[14,92,14,94],[14,95,14,97],[14,158,14,160],[14,161,14,163],[14,164,14,166],[31,3,31,4],[33,3,33,4],[34,3,34,4],[36,3,36,4],[12,1,12,6],[14,1,14,6],[14,9,14,10],[14,11,14,13],[14,14,14,16],[13,1,13,6],[19,11,19,13],[19,14,19,16],[32,3,32,4],[35,3,35,4],[16,80,16,82],[16,83,16,85],[16,86,16,88],[16,89,16,91],[16,92,16,94],[16,95,16,97],[16,98,16,100],[14,32,14,34],[14,74,14,76],[14,41,14,43],[14,44,14,46],[14,83,14,85],[14,86,14,88],[14,47,14,49],[14,50,14,52],[14,53,14,55],[14,56,14,58],[16,74,16,76],[16,77,16,79],[14,62,14,64],[14,65,14,67],[19,17,19,19],[19,29,19,31],[19,32,19,34],[19,35,19,37],[19,20,19,22],[19,9,19,10],[19,23,19,25],[19,26,19,28],[14,59,14,61],[19,38,19,40],[19,41,19,43],[19,44,19,46],[19,47,19,49],[19,50,19,52],[19,53,19,55],[19,56,19,58],[19,59,19,61],[14,17,14,19],[14,20,14,22],[14,23,14,25],[14,26,14,28],[40,3,40,4],[39,3,39,4],[41,3,44,4],[40,2,44,2],[2,4,2,6],[3,4,3,6],[25,3,25,4],[24,3,24,4],[26,3,26,4],[28,3,28,4],[27,3,27,4],[21,3,21,4],[22,1,23,2],[22,3,23,4],[17,1,17,6],[4,3,4,6],[6,3,6,6],[10,1,10,6],[9,1,9,6],[16,1,16,6],[39,1,39,2],[15,1,15,6],[29,3,29,4],[30,3,30,4],[46,1,46,2],[46,3,46,4],[47,3,47,4],[47,1,47,2],[48,1,48,2],[49,1,49,2],[50,1,50,2],[48,3,48,4],[49,3,49,4],[50,3,50,4],[62,1,62,2],[62,3,62,4],[59,9,59,10],[59,11,59,13],[59,14,59,16],[59,17,59,19],[59,20,59,22],[59,23,59,25],[59,26,59,28],[61,1,61,2],[61,3,61,4],[59,29,59,31],[59,32,59,34],[59,35,59,37],[59,38,59,40],[59,41,59,43],[59,44,59,46],[59,47,59,49],[59,50,59,52],[59,53,59,55],[59,56,59,58],[59,59,59,61],[59,62,59,64],[59,65,59,67],[59,68,59,70],[59,71,59,73],[59,74,59,76],[59,77,59,79],[59,80,59,82],[59,83,59,85],[59,86,59,88],[59,89,59,91],[59,92,59,94],[59,95,59,97],[59,98,59,100],[59,101,59,103],[59,104,59,106],[59,107,59,109],[59,110,59,112],[59,113,59,115],[59,116,59,118],[59,119,59,121],[59,122,59,124],[59,125,59,127],[59,128,59,130],[59,131,59,133],[59,134,59,136],[59,137,59,139],[59,140,59,142],[59,143,59,145],[59,146,59,148],[59,149,59,151],[59,152,59,154],[59,155,59,157],[59,158,59,160],[59,161,59,163],[59,164,59,166],[59,167,59,169],[59,170,59,172],[59,173,59,175],[59,176,59,178],[59,179,59,181],[59,182,59,184],[59,185,59,187],[59,188,59,190],[59,191,59,193],[59,194,59,196],[59,197,59,199],[59,200,59,202],[59,203,59,205],[59,206,59,208],[59,209,59,211],[59,212,59,214],[59,215,59,217],[59,245,59,247],[59,248,59,250],[59,251,59,253],[59,254,59,256],[59,218,59,220],[59,221,59,223],[59,224,59,226],[59,227,59,229],[59,230,59,232],[59,233,59,235],[59,236,59,238],[59,239,59,241],[59,242,59,244],[51,5,52,5],[51,3,52,4],[51,1,52,2],[54,1,54,2],[54,3,54,4],[55,1,55,2],[55,3,55,4],[56,3,57,4],[56,1,57,2],[56,5,57,5],[53,1,53,2],[53,3,53,4]]}
["中山間地域等直接支払交付金参考様式集（第6期対策）"]
["★基本情報入力欄　はじめに太枠内の情報を入力してください。"]
[null,"都道府県名",null,"福島県","　←　「都道府県」まで記入してください。"]
[null,"市町村名",null,"福島市","　←　「市町村」まで記入してください。"]
[null,"協定名"]
[null,"代表者名",null,"○○　○○"]
[null,"協定所在地",null,"福島県福島市○○"]
[]
["★記入の手順と注意事項"]
[null,"・「★提出書類と各シートの説明」のシート名をクリックすることで、入力する様式に移動します。または、画面下の様式名を選択すると、入力する様式を切り替えることができます。左下の◀▶をクリックすることで、隠れている様式を表示させることができます。"]
[null,"（※まず初めに、「別紙２①」の「農用地の内訳等及びネットワーク化活動計画」を入力すると作成がスムーズです。）"]
[]
[null,"・すべての集落協定の方が入力する必要のあるセルには、この色（オレンジ色）が塗ってあります。"]
[null,"・該当する場合に、集落協定の方が入力する必要のあるセルには、この色（薄いオレンジ色）が塗ってあります。"]
[null,"・この色（黄緑色）が塗ってあるセルは自動入力されます。自動入力されたものが間違っている場合は、正しく修正してください。（入力されている数式を消去すると、自由に入力できます。）"]
[null,"・市町村に提出する前に、自動集計された箇所も含め、誤りがないかご確認ください。"]
[null,"・行を追加する際は、一番左にある行番号をクリックして行全体をコピーし、表の最下部の太線より上の位置で行番号を右クリックし「コピーしたセルの挿入」を選択してください。"]
[null,"・画面上部に右のような表示が出た場合は「コンテンツの有効化」を押してください。"]
[]
["★提出書類と各シートの説明"]
["１．事業計画の申請時に提出するもの"]
[null,"様式番号",null,"様式名",null,"提出の必要性","シート名"]
[null,"参考様式第４号",null,"多面的機能発揮促進事業に関する計画の認定［変更の認定］の申請について",null,"必須\n（集落・個別協定）","参４_申請"]
[null,null,null,null,null,"必須\n（集落・個別協定）","参４_申請_事業計画"]
[null,null,"別紙様式１\n（共通部分）","農業の有する多面的機能の発揮の促進に関する活動計画書\n（中山間地域等直接支払に関する集落協定）",null,"必須\n（集落・個別協定）","別紙１①"]
[null,null,"　　　別添１","実施区域位置図",null,"必須\n（集落・個別協定）","別紙１②"]
[null,null,"　　　別添２","構成員一覧",null,"必須\n（集落・個別協定）","別紙１③"]
[null,null,"　　　別紙○","２号事業様式（中山間地域等直接支払交付金）",null,"必須\n（集落協定）","別紙１④"]
[null,null,"別紙様式２","農用地の内訳等及びネットワーク化活動計画",null,"必須\n（集落協定）","別紙２①"]
[null,null,"別紙様式３","協定対象施設の管理方法",null,"必須\n（集落協定）","別紙３"]
{"$rows_left_out":34}
{"sheet":"プルダウンリスト","index":1,"n_rows":80,"n_cols":5,"rows_kept":80,"cut":false,"hidden":false,"merged":[]}
["地目、傾斜"]
["田","畑","草地","採草放牧地"]
["急傾斜","急傾斜","急傾斜","急傾斜"]
["緩傾斜","緩傾斜","緩傾斜","緩傾斜"]
["小区画・不整形","高齢化・耕作放棄率","高齢化・耕作放棄率","特認基準"]
["高齢化・耕作放棄率","特認基準","草地比率の高い草地","交付対象外（田採草放牧地混在地）"]
["特認基準","交付対象外（田畑混在地）","特認基準","交付対象外（田採草放牧地混在地以外）"]
["交付対象外","交付対象外（田畑混在地以外）","交付対象外（田草地混在地）","協定に含めない管理すべき農用地"]
["協定に含めない管理すべき農用地","協定に含めない管理すべき農用地","交付対象外（田草地混在地以外）"]
[null,null,"協定に含めない管理すべき農用地"]
[]
[]
["単価一覧"]
["ネットワーク化活動計画","地目","傾斜","ネットワーク化活動計画＋地目＋傾斜","交付単価"]
["〇","田","急傾斜",{"$f":"A15&B15&C15","v":"〇田急傾斜"},21000]
["〇","田","緩傾斜",{"$f":"A16&B16&C16","v":"〇田緩傾斜"},8000]
["〇","田","小区画・不整形","〇田小区画・不整形",8000]
["〇","田","高齢化・耕作放棄率","〇田高齢化・耕作放棄率",8000]
["〇","田","特認基準","〇田特認基準",8000]
["〇","田","交付対象外","〇田交付対象外",0]
["〇","田","協定に含めない管理すべき農用地","〇田協定に含めない管理すべき農用地",0]
["〇","畑","急傾斜","〇畑急傾斜",11500]
["〇","畑","緩傾斜",{"$f":"A23&B23&C23","v":"〇畑緩傾斜"},3500]
["〇","畑","高齢化・耕作放棄率","〇畑高齢化・耕作放棄率",3500]
["〇","畑","特認基準","〇畑特認基準",3500]
["〇","畑","交付対象外（田畑混在地）","〇畑交付対象外（田畑混在地）",0]
["〇","畑","交付対象外（田畑混在地以外）","〇畑交付対象外（田畑混在地以外）",0]
["〇","畑","協定に含めない管理すべき農用地","〇畑協定に含めない管理すべき農用地",0]
["〇","草地","急傾斜","〇草地急傾斜",10500]
["〇","草地","緩傾斜","〇草地緩傾斜",3000]
{"$rows_left_out":51}
{"sheet":"別紙２①","index":2,"n_rows":30,"n_cols":21,"rows_kept":30,"cut":false,"hidden":false,"merged":[[1,0,1,18],[11,0,12,18],[11,20,15,20],[3,0,3,18],[15,17,16,17],[15,18,16,18],[15,15,15,16],[13,15,13,17],[14,15,14,17],[13,0,15,7],[13,8,15,8],[13,10,14,14],[9,2,9,3],[5,5,6,5],[7,5,8,5],[5,6,6,6],[7,6,8,6],[5,2,5,3],[6,2,6,3],[7,2,7,3],[8,2,8,3]]}
[null,null,null,null,null,null,null,null,null,null,null,null,null,null,null,null,null,null,"（別紙様式２）"]
["農用地の内訳等及びネットワーク化活動計画"]
["注１）「農用地の内訳等」は集落協定書に添付し、提出期限（当該年度の６月30日、令和７年度においては８月31日）までに協定農用地の存する市町村長に提出する。"]
["注２）「ネットワーク化活動計画」は、体制整備単価の適用を受けようとする場合に作成するものとし、ネットワーク化活動計画の作成後は、遅滞なく協定農用地の存する市町村長に提出するとともに、令和11年度まで毎年度、記載内容の確認を行うものとする。"]
[null,null,null,null,null,null,null,null,null,null,null,null,null,null,null,null,null,null,null,null,"【別紙２①農用地の内訳等】⑤農用地の管理において、P列[農用地の現況]が\"荒廃農地\"かつQ列[具体的活動内容]が\"復旧\"と入力した面積の計。"]
[null,null,"棚田地域振興活動加算",null,null,"ネットワーク化活動計画を\n作成する",{"$f":"IF(S14=\"\", \"\",S14)","v":""}]
[null,null,"超急傾斜農地保全管理加算"]
[null,null,"ネットワーク化加算",null,null,"ネットワーク化活動計画を\n作成しない",{"$f":"IF(S15=\"\", \"\",S15)","v":""}]
[null,null,"スマート農業加算"]
[null,null,"集落機能強化加算の経過措置"]
[]
["○農用地の内訳等",null,null,null,null,null,null,null,null,null,null,null,null,null,null,null,null,null,null,null,"こちらのセルには関数が入っているので変更しないでください。"]
[]
["\n①現況",null,null,null,null,null,null,null,"\n②基礎・体制整備単価",null,"\n③農業生産活動等の体制整備の取組（ネットワーク化活動計画の作成）の有無",null,null,null,null,"ネットワーク化活動計画を作成する"]
[null,null,null,null,null,null,null,null,null,null,null,null,null,null,null,"ネットワーク化活動計画を作成しない"]
[null,null,null,null,null,null,null,null,null,null,"④加算の適用",null,null,null,null,"⑤農用地の管理",null,"⑥管理者","⑦個人配分を受ける所得超過者の引受地"]
["地域区分","一団の農用地名","団地名","地番","地目","面積(㎡)","交付基準(傾斜等)","超急傾斜農地\n棚田地域振興農地のうち","10a当たりの単価(円)","交付額(円)","棚田地域振興活動加算","超急傾斜農地保全管理加算","ネットワーク化加算","スマート農業加算","集落機能強化加算の経過措置","農用地の現況","具体的な活動内容",null,null,null,"ネットワーク化活動計画＋目＋傾斜"]
[null,null,null,null,null,null,null,null,{"$f":"IFERROR(VLOOKUP(U18,プルダウンリスト!$D$15:$E$70,2,FALSE),\"\")","v":""},{"$f":"IFERROR(ROUNDDOWN(F18*I18/1000,0),\"\")","v":""},"　","　","　","　","　",null,null,null,null,null,{"$f":"$S$14&E18&G18","v":""}]
[null,null,null,null,null,null,null,null,{"$f":"IFERROR(VLOOKUP(U19,プルダウンリスト!$D$15:$E$70,2,FALSE),\"\")","v":""},"","　","　","　","　","　",null,null,null,null,null,""]
[null,null,null,null,null,null,null,null,{"$f":"IFERROR(VLOOKUP(U20,プルダウンリスト!$D$15:$E$70,2,FALSE),\"\")","v":""},"","　","　","　","　","　",null,null,null,null,null,""]
[null,null,null,null,null,null,null,null,{"$f":"IFERROR(VLOOKUP(U21,プルダウンリスト!$D$15:$E$70,2,FALSE),\"\")","v":""},"","　","　","　","　","　",null,null,null,null,null,""]
[null,null,null,null,null,null,null,null,{"$f":"IFERROR(VLOOKUP(U22,プルダウンリスト!$D$15:$E$70,2,FALSE),\"\")","v":""},"","　","　","　","　","　",null,null,null,null,null,""]
[null,null,null,null,null,null,null,null,{"$f":"IFERROR(VLOOKUP(U23,プルダウンリスト!$D$15:$E$70,2,FALSE),\"\")","v":""},"","　","　","　","　","　",null,null,null,null,null,""]
[null,null,null,null,null,null,null,null,{"$f":"IFERROR(VLOOKUP(U24,プルダウンリスト!$D$15:$E$70,2,FALSE),\"\")","v":""},"","　","　","　","　","　",null,null,null,null,null,""]
[null,null,null,null,null,null,null,null,{"$f":"IFERROR(VLOOKUP(U25,プルダウンリスト!$D$15:$E$70,2,FALSE),\"\")","v":""},"","　","　","　","　","　",null,null,null,null,null,""]
[null,null,null,null,null,null,null,null,{"$f":"IFERROR(VLOOKUP(U26,プルダウンリスト!$D$15:$E$70,2,FALSE),\"\")","v":""},"","　","　","　","　","　",null,null,null,null,null,""]
[null,null,null,null,null,null,null,null,{"$f":"IFERROR(VLOOKUP(U27,プルダウンリスト!$D$15:$E$70,2,FALSE),\"\")","v":""},"","　","　","　","　","　",null,null,null,null,null,""]
[null,null,null,null,null,null,null,null,{"$f":"IFERROR(VLOOKUP(U28,プルダウンリスト!$D$15:$E$70,2,FALSE),\"\")","v":""},"","　","　","　","　","　",null,null,null,null,null,""]
[null,null,null,null,null,null,null,null,{"$f":"IFERROR(VLOOKUP(U29,プルダウンリスト!$D$15:$E$70,2,FALSE),\"\")","v":""},"","　","　","　","　","　",null,null,null,null,null,""]
["上記表は以下の表に従って記載するものとする"]
{"$rows_left_out":1}
{"sheet":"参４_申請","index":3,"n_rows":28,"n_cols":30,"rows_kept":28,"cut":false,"hidden":false,"merged":[[17,2,17,4],[18,0,18,5],[20,2,20,4],[22,1,22,4],[3,0,3,1],[7,0,7,5],[9,0,9,5],[11,0,11,5],[13,0,13,5],[16,2,16,4]]}
["（参考様式第４号）",null,null,null,null,null,null,null,null,null,null,null,null,null,null,null,null,null,null,null,null,null,null,null,null,null,null,null,null,"〇"]
[]
[null,null,null,null,"令和　年　　月　　日"]
["福島市長　",null,"殿"]
[null,null,null,"住所"]
[null,null,null,"氏名",{"$f":"はじめに!D6&\"\"","v":"○○　○○"}]
[]
["多面的機能発揮促進事業に関する計画の認定［変更の認定］の申請について"]
[]
["　このことについて、農業の有する多面的機能の発揮の促進に関する法律（平成26年法律第78号）第７条第１項［８条第１項］の規定に基づき、下記関係書類を添えて認定を申請する。"]
[]
[]
["１　事業計画"]
[]
["２　農業の有する多面的機能の発揮の促進に関する活動計画書"]
[null,"□","１号事業（多面的機能支払交付金）"]
[null,"☑","２号事業（中山間地域等直接支払交付金）"]
[null,"□","３号事業（環境保全型農業直接支払交付金）"]
[]
["３　その他"]
[null,"□","都道府県の同意書の写し（都道府県営土地改良施設の管理）"]
[]
[null,"※農山漁村の活性化のための定住等及び地域間交流の促進に関する法律（平成19年法律第48号）第５条第１項に規定する活性化計画が作成されている場合であって、その添付書類として、多面的機能発揮促進事業に関する計画の認定の申請（変更の認定の申請の場合も含む。）に必要な上記１から３までに掲げる書類が既に市町村長に提出されているときは、これらの書類の添付を省略することができる。"]
[]
[null,"□","※に該当するため、書類の添付を省略する。"]
[]
["＜施行注意＞"]
["　変更の認定の申請の場合は、［　］内の記載に置き換えるものとする。"]

{"sheet":"参４_申請_事業計画","index":4,"n_rows":51,"n_cols":7,"rows_kept":51,"cut":false,"hidden":false,"merged":[[38,2,42,7],[45,2,45,7],[48,2,48,7],[50,0,50,7],[24,2,24,3],[24,4,24,7],[25,2,25,3],[25,4,25,7],[28,2,29,7],[34,2,35,7],[23,2,23,3],[23,4,23,7],[2,0,2,7],[4,6,4,7],[5,6,5,7],[10,1,10,7],[13,1,13,7],[18,2,18,7],[19,2,22,3],[19,4,20,4],[19,5,20,7],[21,4,22,4],[21,5,22,7]]}
[]
[]
["多面的機能発揮促進事業に関する計画"]
[]
[null,null,null,null,null,null,{"$f":"参４_申請!E3","v":"令和　年　　月　　日"}]
[null,null,null,null,null,"氏名",{"$f":"はじめに!D5&\"\"","v":""}]
[]
["１ 多面的機能発揮促進事業の目標"]
[]
["１．現況"]
[null,"　本地域は、振興山村に指定されるなど、平場地域と比べて生産条件の格差が大きいことから、これを補正する取組を行うことが必要である。"]
[]
["２．目標"]
[null,"　１を踏まえ、本地域では、機械の共同利用や農作業の共同化にも取り組み、農業生産活動を継続することにより、多面的機能の発揮の促進を図ることとする。"]
[]
["２ 多面的機能発揮促進事業の内容"]
["　（１）多面的機能発揮促進事業の種類及び実施区域"]
["　　① 種類（実施するものに○を付すこと。）"]
[null,null,"１号事業（多面的機能支払交付金）"]
[null,null,null,null,null,"農業の有する多面的機能の発揮の促進に関する法律（平成26年法律第78号。以下「法」という。）第３条第３項第１号イに掲げる施設の維持その他の主として当該施設の機能の保持を図る活動（以下「イの活動」という。）\n（農地維持支払交付金）"]
[]
[null,null,null,null,null,"法第３条第３項第１号ロに掲げる施設の改良その他の主として当該施設の機能の増進を図る活動（以下「ロの活動」という。）\n（資源向上支払交付金）"]
[]
[null,null,"〇",null,"２号事業（中山間地域等直接支払交付金）"]
[null,null,null,null,"３号事業（環境保全型農業直接支払交付金）"]
[null,null,null,null,"４号事業（その他農業の有する多面的機能の発揮の促進に資する事業）"]
[]
["　　② 実施区域"]
[null,null,"　別添の中山間地域等直接支払交付金に係る集落協定（以下、「集落協定」という。）「（別添１）実施区域位置図」のとおり。"]
[]
{"$rows_left_out":22}
{"sheet":"別紙６","index":5,"n_rows":77,"n_cols":33,"rows_kept":77,"cut":false,"hidden":false,"merged":[[7,1,7,4],[7,5,7,12],[7,13,7,20],[7,21,7,28],[8,1,8,4],[8,5,8,12],[8,13,8,20],[8,21,8,28],[1,0,1,32],[2,0,2,32],[6,1,6,4],[6,5,6,12],[6,13,6,20],[6,21,6,28],[11,1,11,4],[11,5,11,12],[11,13,11,20],[11,21,11,28],[15,13,15,18],[16,1,16,6],[16,7,16,12],[16,13,16,18],[9,1,9,4],[9,5,9,12],[9,13,9,20],[9,21,9,28],[10,1,10,4],[10,5,10,12],[10,13,10,20],[10,21,10,28],[32,0,32,1],[32,2,32,28],[33,0,33,1],[33,2,33,28],[34,0,34,1],[34,2,34,28],[17,1,17,6],[17,7,17,12],[17,13,17,18],[20,2,20,32],[30,2,30,32],[31,0,31,1],[31,2,31,28],[38,0,38,1],[38,2,38,28],[39,0,39,1],[39,2,39,28],[40,0,40,1],[40,2,40,28],[35,0,35,1],[35,2,35,28],[36,0,36,1],[36,2,36,28],[37,0,37,1],[37,2,37,28],[41,0,41,1],[41,2,41,28],[44,0,44,28],[45,0,45,4],[45,5,45,9],[45,10,45,11],[45,12,45,16],[45,17,45,18],[45,19,45,21],[45,22,45,27],[53,0,53,1],[53,2,53,28],[54,0,54,1],[54,2,54,28],[55,0,55,1],[55,2,55,28],[46,22,46,27],[47,0,47,4],[47,5,47,28],[51,0,51,1],[51,2,51,28],[52,0,52,1],[52,2,52,28],[46,0,46,4],[46,5,46,9],[46,10,46,11],[46,12,46,16],[46,17,46,18],[46,19,46,21],[59,0,59,1],[59,2,59,28],[60,0,60,1],[60,2,60,28],[61,0,61,1],[61,2,61,28],[56,0,56,1],[56,2,56,28],[57,0,57,1],[57,2,57,28],[58,0,58,1],[58,2,58,28],[76,1,77,32],[72,1,74,3],[72,4,74,11],[72,17,74,24],[72,25,74,32],[73,12,73,16],[75,1,75,32],[62,0,62,32],[63,0,63,32],[64,1,64,32],[65,1,65,32],[68,2,69,32],[71,1,71,3],[71,4,71,11],[71,12,71,16],[71,17,71,24],[71,25,71,32]]}
[null,null,null,null,null,null,null,null,null,null,null,null,null,null,null,null,null,null,null,null,null,null,null,null,null,null,null,null,null,null,null,null,"（別紙様式６）"]
["個　　別　　協　　定"]
["経営規模及び農業所得調書"]
[]
["第１　経営規模"]
[null,null,null,null,null,null,null,null,null,null,null,null,null,null,null,null,null,null,null,null,null,null,null,null,"  (単位：a) "]
[null,"地　目",null,null,null,"自己所有地",null,null,null,null,null,null,null,"借入面積",null,null,null,null,null,null,null," 計"]
[null,"田"]
[null,"畑"]
[null,"草　地"]
[null,"計"]
[null,"採草放牧地"]
[null,"注）借入面積には受託面積（基幹３作業）を含む。"]
[]
["第２　農業従事者一人当たりの農業所得"]
[null,null,null,null,null,null,null,null,null,null,null,null,null,"（単位：円）"]
[null,"農業所得①",null,null,null,null,null,"農業従事者②",null,null,null,null,null," ①／②"]
[]
[null,"注１　農業従事者一人当たりの農業所得は以下のとおり算定する。"]
[null,null,"（確定申告に基づく農業所得＋専従者給与額－負債の償還額）／農業従事者数"]
[null,null,"　当該農業者が生産組織、農地所有適格法人等の構成員であり、当該生産組織、農地所有適格法人等から給与額又は役員報酬等を受けている場合は、上記農業所得に当該給与額又は役員報酬等を含めるものとする。"]
[null,null,"(1) 負債の償還額は実施要領の運用第６の１の(1)のイの(ｱ)による。"]
[null,null,"(2) 農業従事者数は実施要領の運用第６の１の(1)のイの(ｲ)により換算する。"]
[null,"注２　農業所得調書には、農業所得額を証明する書類を添付する。"]
[]
[]
["【農業生産活動等として取り組むべき事項を実施する場合に使用】"]
["第３　農業生産活動等として取り組むべき事項"]
[]
[null,"１　農用地に関する事項"]
{"$rows_left_out":48}
{"sheet":"別紙７","index":6,"n_rows":29,"n_cols":16,"rows_kept":29,"cut":false,"hidden":false,"merged":[[3,14,4,14],[3,15,4,15],[3,5,4,5],[2,0,2,1],[2,2,2,3],[3,0,4,0],[3,1,4,1],[3,2,4,2],[3,3,4,3],[27,0,27,15],[25,0,26,15],[28,0,29,15],[18,0,20,15],[3,6,4,6],[3,7,4,7],[3,8,4,8],[3,9,3,10],[14,0,14,15],[3,4,4,4],[9,0,11,15],[12,0,12,15],[13,0,13,15],[3,11,4,11],[3,12,4,12],[3,13,4,13]]}
[]
["協定農用地の概要"]
["【市町村名：　　　　　　　】",null,{"$f":"はじめに!D4","v":"福島市"},null,"】"]
["交付対象者の氏名・名称","字","地番","地目","傾斜度","面積","10ａ当たりの単価","交付額","設定\n権利等","農用地の管理",null,"設定権利者等名(出し手)","始期","終期","契約\n年月日","交付金の使用方法"]
[null,null,null,null,null,null,null,null,null,"農用地の現況","具体的活動内容"]
[]
[]
[]
["【個別協定の場合】"]
["注１)  一団の農用地全てを耕作する場合及び別紙様式６の経営規模のＡが都府県にあっては３ ha以上、北海道にあっては30ha以上 (草地では100ha以上)の経営の規模を有している場合は、自作地も記入する。但し、農業従事者一人当たりの農業所得が同一都道府県内の都市部の勤労者一人当たりの平均所得を上回る場合は除く。"]
[]
[]
["注２)　注１ の農業従事者一人当たりの農業所得は、別紙様式６の第２の注書きにより算出する。"]
["注３)　注１ の但し書きに該当する者は引受地のみを記入。"]
["注４)　使用方法には、受託者(個別協定の申請者)の受取額及び受取割合を記入すること。"]
[]
[]
["【集落協定の場合】"]
["注１)  農業従事者一人当たりの農業所得が同一都道府県内の都市部の勤労者一人当たりの平均所得を上回る場合にあって、集落協定上の基幹的活動において中核的なリーダーとしての役割を果たす担い手として指定された者において、引受地に対して交付される交付額を個人配分に充てる場合に記入。"]
[]
[]
["注２)  注１に該当する者の個人配分に充てる引受地のみを記入。"]
["注３)  使用方法には、受託者(注１に該当する者)の受取額を記入。"]
[]
["協定農用地の概要"]
["注１　農地又は採草放牧地について、所有権移転、賃借権等を設定した場合は、農地法第３条の規定に基づく許可書又は農地中間管理事業の推進に関する法律第18条に基づく農用地利用集積等促進計画の写しを添付のこと。"]
[]
["注２　農作業受委託の場合は、別添契約書様式例を参考に契約書を作成し、その写しを添付のこと。"]
["注３　申請者の居住する市町村以外に存する農用地について、利用権の設定等を行っており、当該農用地の存する市町村の長に申請書を提出している場合は、当該申請書の写しを添付すること。"]

{"sheet":"別紙７（別添）","index":7,"n_rows":35,"n_cols":29,"rows_kept":35,"cut":false,"hidden":false,"merged":[[21,1,22,32],[1,0,1,32],[3,0,4,32],[6,0,6,6],[8,21,8,32],[9,20,9,31],[10,20,10,31],[11,21,11,32],[12,20,12,31],[13,20,13,31],[16,1,17,32],[18,1,18,32],[25,1,26,32],[30,1,30,3],[30,4,30,6],[30,7,30,9],[30,10,30,12],[30,13,30,15],[30,16,30,18],[30,19,30,21],[30,22,30,24],[30,25,30,27],[30,28,30,30],[31,1,31,3],[31,4,31,6],[31,7,31,9],[31,10,31,12],[31,13,31,15],[31,16,31,18],[31,19,31,21],[31,22,31,24],[31,25,31,27],[31,28,31,30],[32,1,32,3],[32,4,32,6],[32,7,32,9],[32,10,32,12],[32,13,32,15],[32,16,32,18],[32,19,32,21],[32,22,32,24],[32,25,32,27],[32,28,32,30],[33,1,33,3],[33,4,33,6],[33,7,33,9],[33,10,33,12],[33,13,33,15],[33,16,33,18],[33,19,33,21],[33,22,33,24],[33,25,33,27],[34,28,34,30],[33,28,33,30],[34,16,34,18],[34,19,34,21],[34,22,34,24],[34,25,34,27],[34,1,34,3],[34,4,34,6],[34,7,34,9],[34,10,34,12],[34,13,34,15]]}
[]
["農作業受委託契約書（様式例）"]
[]
["　受託者及び委託者は、この契約書の定めるところにより農作業受委託契約を締結する。この契約書は、２通作成して受託者及び委託者がそれぞれ１通所持する。"]
[]
[]
["令和　年　月　日"]
[]
[null,null,null,null,null,null,null,null,null,null,null,null,null,null,null,null,null,null,null,null,null,"受託者（以下「甲」という。）"]
[null,null,null,null,null,null,null,null,null,null,null,null,null,null,null,null,"（住所）"]
[null,null,null,null,null,null,null,null,null,null,null,null,null,null,null,null,"（氏名）"]
[null,null,null,null,null,null,null,null,null,null,null,null,null,null,null,null,null,null,null,null,null,"委託者（以下「乙」という。）"]
[null,null,null,null,null,null,null,null,null,null,null,null,null,null,null,null,"（住所）"]
[null,null,null,null,null,null,null,null,null,null,null,null,null,null,null,null,"（氏名）"]
[]
["１　農作業受委託の内容"]
[null,"　甲は、この契約書に定めるところにより乙により、別表に記載する農作業を受託し、善良なる管理者の注意をもって農作業を実施するものとする。"]
[]
[null,"　乙は、甲が農作業を円滑に行えるよう作付けに十分な配慮をする。"]
[]
["２　受託料の支払方法"]
[null,"　乙は、別表に記載された農作業に対して、同表に記載された金額の受託料を同表に記載された方法により甲に支払う。"]
[]
[]
["３　契約の変更"]
[null,"　契約事項を変更する場合には、甲、乙合意の上、その変更事項をこの契約書に明記する。"]
[]
[]
[]
["（別　表）"]
{"$rows_left_out":6}
{"sheet":"別紙９","index":8,"n_rows":42,"n_cols":10,"rows_kept":42,"cut":false,"hidden":false,"merged":[[33,8,36,8],[33,6,36,6],[33,7,36,7],[33,9,36,9],[26,6,28,6],[26,7,28,7],[26,8,28,8],[26,9,28,9],[29,6,30,6],[29,7,30,7],[29,8,30,8],[29,9,30,9],[20,9,22,9],[24,6,25,6],[24,7,25,7],[24,8,25,8],[24,9,25,9],[15,6,16,6],[15,7,16,7],[15,8,16,8],[15,9,16,9],[17,6,19,6],[17,7,19,7],[17,8,19,8],[17,9,19,9],[4,9,5,9],[6,6,7,6],[6,7,7,7],[6,8,7,8],[6,9,7,9],[12,6,13,6],[12,7,13,7],[12,8,13,8],[12,9,13,9],[9,6,11,6],[9,7,11,7],[9,8,11,8],[9,9,11,9],[4,6,5,6],[17,1,18,1],[17,2,18,2],[17,3,18,3],[17,4,18,4],[40,1,40,8],[25,1,26,1],[25,2,26,2],[25,3,26,3],[25,4,26,4],[27,1,28,1],[27,2,28,2],[27,3,28,3],[27,4,28,4],[19,1,21,1],[19,2,21,2],[19,3,21,3],[19,4,21,4],[22,1,24,1],[22,2,24,2],[22,3,24,3],[22,4,24,4],[20,6,22,6],[20,7,22,7],[20,8,22,8],[41,1,41,8],[6,2,7,2],[6,3,7,3],[6,4,7,4],[8,2,9,2],[8,4,9,4],[6,1,7,1],[8,1,9,1],[8,3,9,3],[37,6,38,6],[37,7,38,7],[37,8,38,8],[30,1,31,1],[30,2,31,2],[30,3,31,3],[30,4,31,4],[15,1,16,1],[15,2,16,2],[15,3,16,3],[15,4,16,4],[10,1,11,1],[10,2,11,2],[10,3,11,3],[10,4,11,4],[2,3,2,8],[4,1,5,1],[4,2,5,2],[4,3,5,3],[4,4,5,4],[4,7,5,7],[4,8,5,8],[37,9,38,9],[35,1,37,1],[35,2,37,2],[35,3,37,3],[35,4,37,4],[32,1,34,1],[32,2,34,2],[32,3,34,3],[32,4,34,4],[31,6,32,6],[31,7,32,7],[31,8,32,8],[31,9,32,9],[12,1,13,1],[12,2,13,2],[12,3,13,3],[12,4,13,4]]}
[null,null,null,null,null,null,null,null,null,"（ 別紙様式９ ）"]
[]
[null,null,null,"環境負荷低減のチェックシート（個別協定向け）"]
[]
[null,null,"申請時\n（します）","（１）適正な施肥","報告時\n（しました）",null,null,"申請時\n（します）","（４）悪臭及び害虫の発生防止","報告時\n（しました）"]
[]
[null,"①","□","肥料の適正な保管","□",null,"⑫","□","悪臭・害虫の発生防止・低減に努める","□"]
[]
[null,"②","□","肥料の使用状況等の記録・保存に努める","□"]
[null,null,null,null,null,null,null,"申請時\n（します）","（５）廃棄物の発生抑制、\n　　 適正な循環的な利用及び適正な処分","報告時\n（しました）"]
[null,"③","□","作物特性のデータに基づく施肥設計を検討","□"]
[]
[null,"④","□","有機物の適正な施用による土づくりを検討","□",null,"⑬","□","プラ等廃棄物の削減に努め、適正に処理","□"]
[]
[]
[null,null,"申請時\n（します）","（２）適正な防除","報告時\n（しました）",null,null,"申請時\n（します）","（６）生物多様性への悪影響の防止","報告時\n（しました）"]
[]
[null,"⑤","□","病害虫・雑草が発生しにくい生産条件の整備を検討","□",null,"⑭","□","病害虫・雑草の発生状況を把握した上で防除の要否及びタイミングの判断に努める（再掲）","□"]
[]
[null,"⑥","□","病害虫・雑草の発生状況を把握した上で防除の要否及びタイミングの判断に努める","□"]
[null,null,null,null,null,null,"⑮","□","多様な防除方法（防除資材、使用方法）を活用した防除を検討（再掲）","□"]
[]
[null,"⑦","□","多様な防除方法（防除資材、使用方法）を活用した防除を検討","□"]
[]
[null,null,null,null,null,null,null,"申請時\n（します）","（７）環境関係法令の遵守等","報告時\n（しました）"]
[null,"⑧","□","農薬の適正な使用・保管","□"]
[null,null,null,null,null,null,"⑯","□","「みどりの食料システム戦略」を理解し、適切な事業実施に努める","□"]
[null,"⑨","□","農薬の使用状況等の記録・保存","□"]
[]
[null,null,null,null,null,null,"⑰","□","関係法令の遵守","□"]
{"$rows_left_out":12}